ID,Experiment_ID,Assembly_ID,Atm_obs_assembly_atom_ID,Atm_obs_entity_assembly_ID,Atm_obs_entity_ID,Atm_obs_comp_index_ID,Atm_obs_seq_ID,Atm_obs_comp_ID,Atm_obs_atom_ID,Atm_obs_atom_type,Atm_obs_atom_isotope_number,Resonance_ID,Atm_obs_auth_entity_assembly_ID,Atm_obs_auth_seq_ID,Atm_obs_auth_comp_ID,Atm_obs_auth_atom_ID,Expt_observed_param,Val_type,Val,Val_err,Val_units,Sf_ID,Entry_ID,Binding_value_list_ID
1,1,1,,1,1,,,,,,,,,,,,chemical shifts,Kd,28,,uM,47712,16414,1
2,2,1,,1,1,,,,,,,,,,,,chemical shifts,Kd,24,,uM,47712,16414,1
1,1,1,,1,1,,,,,,,,,,,,chemical shifts,Kd,7.5,,uM,47733,16415,1
2,2,1,,1,1,,,,,,,,,,,,chemical shifts,Kd,7.5,,uM,47733,16415,1
3,3,1,,1,1,,,,,,,,,,,,chemical shifts,Kd,7.5,,uM,47733,16415,1
4,4,1,,1,1,,,,,,,,,,,,chemical shifts,Kd,7.5,,uM,47733,16415,1
5,5,1,,1,1,,,,,,,,,,,,chemical shifts,Kd,7.5,,uM,47733,16415,1
6,6,1,,1,1,,,,,,,,,,,,chemical shifts,Kd,7.5,,uM,47733,16415,1
7,1,1,,1,1,,,,,,,,,,,,chemical shifts,Kd,35.7,,uM,47733,16415,1
8,2,1,,1,1,,,,,,,,,,,,chemical shifts,Kd,35.7,,uM,47733,16415,1
9,3,1,,1,1,,,,,,,,,,,,chemical shifts,Kd,35.7,,uM,47733,16415,1
10,4,1,,1,1,,,,,,,,,,,,chemical shifts,Kd,35.7,,uM,47733,16415,1
11,5,1,,1,1,,,,,,,,,,,,chemical shifts,Kd,35.7,,uM,47733,16415,1
12,6,1,,1,1,,,,,,,,,,,,chemical shifts,Kd,35.7,,uM,47733,16415,1
1,,1,,1,3,,,,,,,,,,,,chemical shifts,Kd,0.27,,mM,47753,16416,1
1,1,1,,1,1,,,,,,,,,,,,chemical shifts,Kd,16,,uM,47772,16417,1
2,2,1,,1,1,,,,,,,,,,,,chemical shifts,Kd,16,,uM,47772,16417,1
3,3,1,,1,1,,,,,,,,,,,,chemical shifts,Kd,16,,uM,47772,16417,1
4,4,1,,1,1,,,,,,,,,,,,chemical shifts,Kd,16,,uM,47772,16417,1
1,1,1,,1,1,34,34,THR,,,,,,,,,chemical shifts,Kd,65.6,0.3,uM,47792,16418,1
2,1,1,,1,1,40,40,GLY,,,,,,,,,chemical shifts,Kd,13.2,0.3,uM,47792,16418,1
3,1,1,,1,1,44,44,THR,,,,,,,,,chemical shifts,Kd,55.8,0.3,uM,47792,16418,1
4,2,1,,1,1,47,47,GLU,,,,,,,,,chemical shifts,Kd,77.1,0.3,uM,47792,16418,1
5,2,1,,1,1,74,74,ARG,,,,,,,,,chemical shifts,Kd,88.2,0.3,uM,47792,16418,1
6,3,1,,1,1,79,79,THR,,,,,,,,,chemical shifts,Kd,76.3,0.3,uM,47792,16418,1
7,3,1,,1,1,87,87,GLU,,,,,,,,,chemical shifts,Kd,12.3,0.3,uM,47792,16418,1
8,4,1,,1,1,89,89,PHE,,,,,,,,,chemical shifts,Kd,47.5,0.3,uM,47792,16418,1
9,4,1,,1,1,94,94,LYS,,,,,,,,,chemical shifts,Kd,52.0,0.3,uM,47792,16418,1
10,5,1,,1,1,95,95,ASP,,,,,,,,,chemical shifts,Kd,64.7,0.3,uM,47792,16418,1
11,5,1,,1,1,96,96,GLY,,,,,,,,,chemical shifts,Kd,70.2,0.3,uM,47792,16418,1
12,6,1,,1,1,111,111,ASN,,,,,,,,,chemical shifts,Kd,23.5,0.3,uM,47792,16418,1
13,6,1,,1,1,115,115,LYS,,,,,,,,,chemical shifts,Kd,20.3,0.3,uM,47792,16418,1
14,7,1,,1,1,116,116,LEU,,,,,,,,,chemical shifts,Kd,18.6,0.3,uM,47792,16418,1
15,7,1,,1,1,117,117,THR,,,,,,,,,chemical shifts,Kd,23.4,0.3,uM,47792,16418,1
1,1,1,,1,1,,,,,,,,,,,,chemical shifts,Kd,560,70,mM,47838,16420,1
1,2,1,,1,1,,,,,,,,,,,,chemical shifts,Ki,0.095,0.0076,nM,47856,16421,1
2,3,1,,1,1,,,,,,,,,,,,chemical shifts,Ki,0.095,0.0076,nM,47856,16421,1
1,1,1,,1,1,,,,,,,,,,,,chemical shifts,Kd,8.02,1.48,uM,47883,16422,1
2,2,1,,1,1,,,,,,,,,,,,chemical shifts,Kd,8.02,1.48,uM,47883,16422,1
3,3,1,,1,1,,,,,,,,,,,,chemical shifts,Kd,8.02,1.48,uM,47883,16422,1
4,4,1,,1,1,,,,,,,,,,,,chemical shifts,Kd,8.02,1.48,uM,47883,16422,1
5,5,1,,1,1,,,,,,,,,,,,chemical shifts,Kd,8.02,1.48,uM,47883,16422,1
6,6,1,,1,1,,,,,,,,,,,,chemical shifts,Kd,8.02,1.48,uM,47883,16422,1
7,7,1,,1,1,,,,,,,,,,,,chemical shifts,Kd,8.02,1.48,uM,47883,16422,1
8,8,1,,1,1,,,,,,,,,,,,chemical shifts,Kd,8.02,1.48,uM,47883,16422,1
1,1,1,,1,1,,,,,,,,,,,,chemical shifts,Kd,1,,uM,47903,16423,1
2,4,1,,1,1,,,,,,,,,,,,chemical shifts,Kd,1,,uM,47903,16423,1
3,9,1,,1,1,,,,,,,,,,,,chemical shifts,Kd,1,,uM,47903,16423,1
1,1,1,,1,1,,,,,,,,,,,,chemical shifts,Kd,1.5,0.1,mM,48414,16453,1
2,2,1,,1,1,,,,,,,,,,,,chemical shifts,Kd,1.5,0.1,mM,48414,16453,1
3,3,1,,1,1,,,,,,,,,,,,chemical shifts,Kd,1.5,0.1,mM,48414,16453,1
4,4,1,,1,1,,,,,,,,,,,,chemical shifts,Kd,1.5,0.1,mM,48414,16453,1
5,5,1,,1,1,,,,,,,,,,,,chemical shifts,Kd,1.5,0.1,mM,48414,16453,1
6,6,1,,1,1,,,,,,,,,,,,chemical shifts,Kd,1.5,0.1,mM,48414,16453,1
1,1,1,,1,1,,,,,,,,,,,,chemical shifts,Kd,140,,uM,48432,16454,1
1,2,1,,1,1,,,,,,,,,,,,chemical shifts,Kd,41,19,mM,48466,16455,1
2,3,1,,1,1,,,,,,,,,,,,chemical shifts,Kd,41,19,mM,48466,16455,1
3,4,1,,1,1,,,,,,,,,,,,chemical shifts,Kd,41,19,mM,48466,16455,1
4,5,1,,1,1,,,,,,,,,,,,chemical shifts,Kd,41,19,mM,48466,16455,1
5,6,1,,1,1,,,,,,,,,,,,chemical shifts,Kd,41,19,mM,48466,16455,1
6,7,1,,1,1,,,,,,,,,,,,chemical shifts,Kd,41,19,mM,48466,16455,1
7,8,1,,1,1,,,,,,,,,,,,chemical shifts,Kd,41,19,mM,48466,16455,1
8,9,1,,1,1,,,,,,,,,,,,chemical shifts,Kd,41,19,mM,48466,16455,1
9,10,1,,1,1,,,,,,,,,,,,chemical shifts,Kd,41,19,mM,48466,16455,1
10,11,1,,1,1,,,,,,,,,,,,chemical shifts,Kd,41,19,mM,48466,16455,1
11,12,1,,1,1,,,,,,,,,,,,chemical shifts,Kd,41,19,mM,48466,16455,1
12,13,1,,1,1,,,,,,,,,,,,chemical shifts,Kd,41,19,mM,48466,16455,1
13,14,1,,1,1,,,,,,,,,,,,chemical shifts,Kd,41,19,mM,48466,16455,1
14,15,1,,1,1,,,,,,,,,,,,chemical shifts,Kd,41,19,mM,48466,16455,1
15,16,1,,1,1,,,,,,,,,,,,chemical shifts,Kd,41,19,mM,48466,16455,1
16,17,1,,1,1,,,,,,,,,,,,chemical shifts,Kd,41,19,mM,48466,16455,1
17,18,1,,1,1,,,,,,,,,,,,chemical shifts,Kd,41,19,mM,48466,16455,1
18,19,1,,1,1,,,,,,,,,,,,chemical shifts,Kd,41,19,mM,48466,16455,1
19,20,1,,1,1,,,,,,,,,,,,chemical shifts,Kd,41,19,mM,48466,16455,1
1,1,1,,1,1,,,,,,,,,,,,chemical shifts,Kd,0.2,,mM,48492,16456,1
2,2,1,,1,1,,,,,,,,,,,,chemical shifts,Kd,0.2,,mM,48492,16456,1
3,3,1,,1,1,,,,,,,,,,,,chemical shifts,Kd,0.2,,mM,48492,16456,1
4,4,1,,1,1,,,,,,,,,,,,chemical shifts,Kd,0.2,,mM,48492,16456,1
5,5,1,,1,1,,,,,,,,,,,,chemical shifts,Kd,0.2,,mM,48492,16456,1
6,6,1,,1,1,,,,,,,,,,,,chemical shifts,Kd,0.2,,mM,48492,16456,1
7,7,1,,1,1,,,,,,,,,,,,chemical shifts,Kd,0.2,,mM,48492,16456,1
8,8,1,,1,1,,,,,,,,,,,,chemical shifts,Kd,0.2,,mM,48492,16456,1
1,1,1,,1,1,,,,,,,,,,,,chemical shifts,Kd,17,10,uM,48514,16457,1
2,2,1,,1,1,,,,,,,,,,,,chemical shifts,Kd,17,10,uM,48514,16457,1
3,3,1,,1,1,,,,,,,,,,,,chemical shifts,Kd,17,10,uM,48514,16457,1
4,4,1,,1,1,,,,,,,,,,,,chemical shifts,Kd,17,10,uM,48514,16457,1
5,5,1,,1,1,,,,,,,,,,,,chemical shifts,Kd,17,10,uM,48514,16457,1
6,6,1,,1,1,,,,,,,,,,,,chemical shifts,Kd,17,10,uM,48514,16457,1
7,7,1,,1,1,,,,,,,,,,,,chemical shifts,Kd,17,10,uM,48514,16457,1
8,8,1,,1,1,,,,,,,,,,,,chemical shifts,Kd,17,10,uM,48514,16457,1
1,2,1,,1,1,,,,,,,,,,,,chemical shifts,Kd,20,,uM,48537,16458,1
1,1,1,,1,1,,,,,,,,,,,,chemical shifts,Kd,130,96,uM,48556,16459,1
2,2,1,,1,1,,,,,,,,,,,,chemical shifts,Kd,130,96,uM,48556,16459,1
1,1,1,,1,1,,,,,,,,,,,,chemical shifts,Kd,5.6,0.7,mM,48586,16460,1
1,1,1,,1,1,,,,,H,1,,,,,,chemical shifts,Kd,0.9,0.3,mM,48604,16461,1
2,2,1,,1,1,,,,,H,1,,,,,,chemical shifts,Kd,0.9,0.3,mM,48604,16461,1
3,3,1,,1,1,,,,,H,1,,,,,,chemical shifts,Kd,0.9,0.3,mM,48604,16461,1
4,1,1,,1,1,,,,,N,15,,,,,,chemical shifts,Kd,0.6,0.8,mM,48604,16461,1
5,2,1,,1,1,,,,,N,15,,,,,,chemical shifts,Kd,0.6,0.8,mM,48604,16461,1
6,3,1,,1,1,,,,,N,15,,,,,,chemical shifts,Kd,0.6,0.8,mM,48604,16461,1
1,1,1,,1,1,,,,,,,,,,,,chemical shifts,Kd,377,38,uM,48623,16462,1
1,1,1,,1,1,,,,,,,,,,,,chemical shifts,Kd,1.9,0.9,M,54519,16751,1
2,3,1,,1,1,,,,,,,,,,,,chemical shifts,Kd,1.3,0.10,M,54519,16751,1
3,5,1,,1,1,,,,,,,,,,,,chemical shifts,Kd,1.5,0.07,M,54519,16751,1
4,7,1,,1,1,,,,,,,,,,,,chemical shifts,Kd,1.8,0.14,M,54519,16751,1
1,2,1,,1,1,,,,,,,,,,,,chemical shifts,Kd,30.4,6.0,uM,54536,16752,1
2,2,1,,1,1,,,,,,,,,,,,chemical shifts,Kd,38,24,uM,54536,16752,1
3,4,1,,1,1,,,,,,,,,,,,chemical shifts,Kd,30.4,6.0,uM,54536,16752,1
4,4,1,,1,1,,,,,,,,,,,,chemical shifts,Kd,38,24,uM,54536,16752,1
1,1,1,,1,1,,,,,,,,,,,,chemical shifts,Kd,134,,uM,54551,16753,1
2,1,1,,1,1,,,,,,,,,,,,chemical shifts,Kd,138,,uM,54551,16753,1
3,1,1,,1,1,,,,,,,,,,,,chemical shifts,Kd,140,,uM,54551,16753,1
4,1,1,,1,1,,,,,,,,,,,,chemical shifts,Kd,149,,uM,54551,16753,1
1,1,1,,1,1,,,,,,,,,,,,chemical shifts,Kd,180,59,uM,54566,16754,1
1,4,1,,1,1,,,,,,,,,,,,chemical shifts,Kd,9,,uM,54582,16755,1
1,1,1,,1,1,,,,,,,,,,,,chemical shifts,Kd,30,11,uM,54609,16756,1
2,2,1,,1,1,,,,,,,,,,,,chemical shifts,Kd,30,11,uM,54609,16756,1
3,3,1,,1,1,,,,,,,,,,,,chemical shifts,Kd,30,11,uM,54609,16756,1
4,4,1,,1,1,,,,,,,,,,,,chemical shifts,Kd,30,11,uM,54609,16756,1
5,5,1,,1,1,,,,,,,,,,,,chemical shifts,Kd,30,11,uM,54609,16756,1
6,6,1,,1,1,,,,,,,,,,,,chemical shifts,Kd,30,11,uM,54609,16756,1
1,1,1,,1,1,,,,,,,,,,,,chemical shifts,Kd,41,,fM,54624,16757,1
1,1,1,,1,1,,,,,,,,,,,,chemical shifts,logK,5.65,0.17,,54639,16758,1
2,1,1,,1,1,,,,,,,,,,,,chemical shifts,logK,5.47,0.10,,54639,16758,1
3,1,1,,1,1,,,,,,,,,,,,chemical shifts,logK,5.27,0.02,,54639,16758,1
4,1,1,,1,1,,,,,,,,,,,,chemical shifts,logK,5.11,0.04,,54639,16758,1
5,1,1,,1,1,,,,,,,,,,,,chemical shifts,logK,4.74,0.10,,54639,16758,1
6,1,1,,1,1,,,,,,,,,,,,chemical shifts,logK,4.42,0.11,,54639,16758,1
7,1,1,,1,1,,,,,,,,,,,,chemical shifts,logK,4.66,0.12,,54639,16758,1
8,1,1,,1,1,,,,,,,,,,,,chemical shifts,logK,4.61,0.09,,54639,16758,1
9,1,1,,1,1,,,,,,,,,,,,chemical shifts,logK,4.67,0.09,,54639,16758,1
10,1,1,,1,1,,,,,,,,,,,,chemical shifts,logK,4.63,0.06,,54639,16758,1
11,1,1,,1,1,,,,,,,,,,,,chemical shifts,logK,4.17,0.05,,54639,16758,1
12,1,1,,1,1,,,,,,,,,,,,chemical shifts,logK,3.73,0.06,,54639,16758,1
13,1,1,,1,1,,,,,,,,,,,,chemical shifts,logK,3.40,0.15,,54639,16758,1
1,1,1,,1,1,,,,,,,,,,,,chemical shifts,Kd,0.0002,,M,54655,16759,1
2,2,1,,1,1,,,,,,,,,,,,chemical shifts,Kd,0.0002,,M,54655,16759,1
1,1,1,,1,1,,,,,,,,,,,,chemical shifts,Kd,100,,KM-1,54682,16760,1
1,2,1,,1,1,,,,,,,,,,,,chemical shifts,Kd,70,,uM,54702,16761,1
1,1,1,,1,1,,,,,,,,,,,,chemical shifts,Kd,157,70,uM,54717,16762,1
1,1,1,,1,1,,,,,,,,,,,,,Kd,52,10,uM,54736,16763,1
2,2,1,,1,1,,,,,,,,,,,,,Kd,41,6,uM,54736,16763,1
1,1,1,,1,1,,,,,,,,,,,,chemical shifts,Kd,1.1,0.2,kM,60425,17052,1
2,1,2,,1,1,,,,,,,,,,,,chemical shifts,Kd,0.6,0.2,kM,60425,17052,1
1,1,1,,1,1,,,,,,,,,,,,chemical shifts,Ka,8,2,mM-1,60441,17053,1
1,1,1,,1,1,,,,,,,,,,,,chemical shifts,Kd,358.21,54.33,M,60456,17054,1
1,1,1,,1,1,,,,,,,,,,,,chemical shifts,Kd,2,,uM,60473,17055,1
1,1,1,,1,1,,15,TRP,,,,,,,,,chemical shifts,Kd,2.6,1.7,mM,60488,17056,1
1,1,1,,1,1,,,,,,,,,,,,chemical shifts,Kd,0.035,0.008,mM,60505,17057,1
2,1,1,,1,1,,,,,,,,,,,,chemical shifts,Kd,0.043,0.013,mM,60505,17057,1
1,1,1,,1,1,,,,,,,,,,,,chemical shifts,Kd,33.8,2.0,mM,60520,17058,1
2,2,1,,1,1,,,,,,,,,,,,chemical shifts,Kd,33.8,2.0,mM,60520,17058,1
3,3,1,,1,1,,,,,,,,,,,,chemical shifts,Kd,33.8,2.0,mM,60520,17058,1
1,1,1,,1,1,,77,GLY,,,,,,,,,chemical shifts,Kd,52,10,uM,60538,17059,1
2,2,1,,1,2,,,,,,,,,,,,chemical shifts,Kd,41,6,uM,60538,17059,1
3,1,1,,1,1,,,,,,,,,,,,chemical shifts,Ka,50,,uM,60538,17059,1
4,2,1,,1,1,,,,,,,,,,,,chemical shifts,Ka,50,,uM,60538,17059,1
1,1,1,,1,1,,,,,,,,,,,,chemical shifts,Kd,0.5,0.19,uM,60567,17060,1
1,1,1,,1,1,,,,,,,,,,,,chemical shifts,Kd,480,130,uM,60584,17061,1
1,,1,,1,1,,,,,,,,,,,,calculated from rate constants,Kd,180,,uM,61250,17093,1
2,,1,,1,1,,,,,,,,,,,,calculated from rate constants,Kd,7,,uM,61250,17093,1
1,,1,,1,1,,,,,,,,,,,,chemical shifts,Ka,0.15,,MM-1,61290,17095,1
1,,1,,1,1,,,,,,,,,,,,chemical shifts,Kd,1.70,,mM,61356,17099,1
1,1,1,,1,1,,,,,,,,,,,,chemical shifts,Ka,1000,440,M-1,61414,17101,1
1,2,1,,1,1,,,,,,,,,,,,chemical shifts,Ka,200,60,M-1,61415,17101,2
1,,1,,1,1,,,,,,,,,,,,chemical shifts,Kd,0.22,0.2,uM,61656,17114,1
2,,1,,1,1,,,,,,,,,,,,chemcial shifts,kon,1,0.01,GM,61656,17114,1
1,1,1,,1,1,,,,,,,,,,,,chemical shifts,Kd,5.68,,M-1,61685,17116,1
1,,1,,1,1,,,,,,,,,,,,chemical shifts,Kd,64,8,uM,61704,17118,1
1,1,1,,1,1,,,,,,,,,,,,chemical shifts,Kd,40,,uM,61720,17119,1
1,1,1,,1,1,,,,,,,,,,,,chemical shifts,k12,325,,M-1 s-1,61749,17120,1
2,1,2,,1,1,,,,,,,,,,,,chemical shifts,K1,25,,M-1,61749,17120,1
3,1,3,,1,1,,,,,,,,,,,,chemical shifts,k13,43.3,,M-1 s-1,61749,17120,1
4,1,4,,1,1,,,,,,,,,,,,chemical shifts,K2,24.6,,M-1,61749,17120,1
5,1,5,,1,1,,,,,,,,,,,,chemical shifts,K3,1.00,,,61749,17120,1
1,1,1,,1,1,,,,,,,,,,,,chemical shifts,K1,0.05,,mM-1,62914,17178,1
2,1,1,,1,1,,,,,,,,,,,,chemical shifts,K2,0.02,,mM-2,62914,17178,1
3,1,1,,1,1,,,,,,,,,,,,chemical shifts,K3,0.00021,,mM-3,62914,17178,1
1,1,1,,1,1,,,,,H,2,,,,,,chemical shifts,Ka1,0.040,,M-1,62949,17180,1
2,1,1,,1,1,,,,,H,13,,,,,,chemical shifts,Ka1,0.040,,M-1,62949,17180,1
3,1,1,,1,1,,,,,H,11,,,,,,chemical shifts,Ka1,0.037,,M-1,62949,17180,1
4,1,1,,1,1,,,,,H,2,,,,,,chemical shifts,Ka2,0.005,,M-1,62949,17180,1
5,1,1,,1,1,,,,,H,13,,,,,,chemical shifts,Ka2,0.005,,M-1,62949,17180,1
6,1,1,,1,1,,,,,H,11,,,,,,chemical shifts,Ka2,0.005,,M-1,62949,17180,1
7,2,1,,1,1,,,,,H,2,,,,,,chemical shifts,Ka1,0.026,,M-1,62949,17180,1
8,2,1,,1,1,,,,,H,13,,,,,,chemical shifts,Ka1,0.020,,M-1,62949,17180,1
9,2,1,,1,1,,,,,H,11,,,,,,chemical shifts,Ka1,0.020,,M-1,62949,17180,1
10,2,1,,1,1,,,,,H,2,,,,,,chemical shifts,Ka2,0.005,,M-1,62949,17180,1
11,2,1,,1,1,,,,,H,13,,,,,,chemical shifts,Ka2,0.005,,M-1,62949,17180,1
12,2,1,,1,1,,,,,H,11,,,,,,chemical shifts,Ka2,0.006,,M-1,62949,17180,1
13,3,1,,1,1,,,,,H,2,,,,,,chemical shifts,Ka1,0.012,,M-1,62949,17180,1
14,3,1,,1,1,,,,,H,13,,,,,,chemical shifts,Ka1,0.011,,M-1,62949,17180,1
15,3,1,,1,1,,,,,H,11,,,,,,chemical shifts,Ka1,0.011,,M-1,62949,17180,1
16,3,1,,1,1,,,,,H,2,,,,,,chemical shifts,Ka2,0.004,,M-1,62949,17180,1
17,3,1,,1,1,,,,,H,13,,,,,,chemical shifts,Ka2,0.004,,M-1,62949,17180,1
18,3,1,,1,1,,,,,H,11,,,,,,chemical shifts,Ka2,0.004,,M-1,62949,17180,1
19,4,1,,1,1,,,,,H,2,,,,,,chemical shifts,Ka1,0.011,,M-1,62949,17180,1
20,4,1,,1,1,,,,,H,13,,,,,,chemical shifts,Ka1,0.010,,M-1,62949,17180,1
21,4,1,,1,1,,,,,H,11,,,,,,chemical shifts,Ka1,0.010,,M-1,62949,17180,1
22,4,1,,1,1,,,,,H,2,,,,,,chemical shifts,Ka2,0.003,,M-1,62949,17180,1
23,4,1,,1,1,,,,,H,13,,,,,,chemical shifts,Ka2,0.003,,M-1,62949,17180,1
24,4,1,,1,1,,,,,H,11,,,,,,chemical shifts,Ka2,0.003,,M-1,62949,17180,1
25,5,1,,1,1,,,,,H,2,,,,,,chemical shifts,Ka1,0.014,,M-1,62949,17180,1
26,5,1,,1,1,,,,,H,13,,,,,,chemical shifts,Ka1,0.014,,M-1,62949,17180,1
27,5,1,,1,1,,,,,H,11,,,,,,chemical shifts,Ka1,0.014,,M-1,62949,17180,1
28,5,1,,1,1,,,,,H,2,,,,,,chemical shifts,Ka2,0.003,,M-1,62949,17180,1
29,5,1,,1,1,,,,,H,13,,,,,,chemical shifts,Ka2,0.003,,M-1,62949,17180,1
30,5,1,,1,1,,,,,H,11,,,,,,chemical shifts,Ka2,0.003,,M-1,62949,17180,1
31,6,1,,1,1,,,,,H,2,,,,,,chemical shifts,Ka1,0.008,,M-1,62949,17180,1
32,6,1,,1,1,,,,,H,13,,,,,,chemical shifts,Ka1,0.008,,M-1,62949,17180,1
33,6,1,,1,1,,,,,H,11,,,,,,chemical shifts,Ka1,0.006,,M-1,62949,17180,1
34,6,1,,1,1,,,,,H,2,,,,,,chemical shifts,Ka2,0.004,,M-1,62949,17180,1
35,6,1,,1,1,,,,,H,13,,,,,,chemical shifts,Ka2,0.005,,M-1,62949,17180,1
36,6,1,,1,1,,,,,H,11,,,,,,chemical shifts,Ka2,0.005,,M-1,62949,17180,1
37,1,1,,1,1,,,,,H,15,,,,,,chemical shifts,Ka1,0.040,,M-1,62949,17180,1
38,1,1,,1,1,,,,,H,23,,,,,,chemical shifts,Ka1,0.040,,M-1,62949,17180,1
39,1,1,,1,1,,,,,H,25,,,,,,chemical shifts,Ka1,0.037,,M-1,62949,17180,1
40,1,1,,1,1,,,,,H,15,,,,,,chemical shifts,Ka2,0.005,,M-1,62949,17180,1
41,1,1,,1,1,,,,,H,23,,,,,,chemical shifts,Ka2,0.005,,M-1,62949,17180,1
42,1,1,,1,1,,,,,H,25,,,,,,chemical shifts,Ka2,0.005,,M-1,62949,17180,1
43,2,1,,1,1,,,,,H,15,,,,,,chemical shifts,Ka1,0.026,,M-1,62949,17180,1
44,2,1,,1,1,,,,,H,23,,,,,,chemical shifts,Ka1,0.020,,M-1,62949,17180,1
45,2,1,,1,1,,,,,H,25,,,,,,chemical shifts,Ka1,0.020,,M-1,62949,17180,1
46,2,1,,1,1,,,,,H,15,,,,,,chemical shifts,Ka2,0.005,,M-1,62949,17180,1
47,2,1,,1,1,,,,,H,23,,,,,,chemical shifts,Ka2,0.005,,M-1,62949,17180,1
48,2,1,,1,1,,,,,H,25,,,,,,chemical shifts,Ka2,0.006,,M-1,62949,17180,1
49,3,1,,1,1,,,,,H,15,,,,,,chemical shifts,Ka1,0.012,,M-1,62949,17180,1
50,3,1,,1,1,,,,,H,23,,,,,,chemical shifts,Ka1,0.011,,M-1,62949,17180,1
51,3,1,,1,1,,,,,H,25,,,,,,chemical shifts,Ka1,0.011,,M-1,62949,17180,1
52,3,1,,1,1,,,,,H,15,,,,,,chemical shifts,Ka2,0.004,,M-1,62949,17180,1
53,3,1,,1,1,,,,,H,23,,,,,,chemical shifts,Ka2,0.004,,M-1,62949,17180,1
54,3,1,,1,1,,,,,H,25,,,,,,chemical shifts,Ka2,0.004,,M-1,62949,17180,1
55,4,1,,1,1,,,,,H,15,,,,,,chemical shifts,Ka1,0.011,,M-1,62949,17180,1
56,4,1,,1,1,,,,,H,23,,,,,,chemical shifts,Ka1,0.010,,M-1,62949,17180,1
57,4,1,,1,1,,,,,H,25,,,,,,chemical shifts,Ka1,0.010,,M-1,62949,17180,1
58,4,1,,1,1,,,,,H,15,,,,,,chemical shifts,Ka2,0.003,,M-1,62949,17180,1
59,4,1,,1,1,,,,,H,23,,,,,,chemical shifts,Ka2,0.003,,M-1,62949,17180,1
60,4,1,,1,1,,,,,H,25,,,,,,chemical shifts,Ka2,0.003,,M-1,62949,17180,1
61,5,1,,1,1,,,,,H,15,,,,,,chemical shifts,Ka1,0.014,,M-1,62949,17180,1
62,5,1,,1,1,,,,,H,23,,,,,,chemical shifts,Ka1,0.014,,M-1,62949,17180,1
63,5,1,,1,1,,,,,H,25,,,,,,chemical shifts,Ka1,0.014,,M-1,62949,17180,1
64,5,1,,1,1,,,,,H,15,,,,,,chemical shifts,Ka2,0.003,,M-1,62949,17180,1
65,5,1,,1,1,,,,,H,23,,,,,,chemical shifts,Ka2,0.003,,M-1,62949,17180,1
66,5,1,,1,1,,,,,H,25,,,,,,chemical shifts,Ka2,0.003,,M-1,62949,17180,1
67,6,1,,1,1,,,,,H,15,,,,,,chemical shifts,Ka1,0.008,,M-1,62949,17180,1
68,6,1,,1,1,,,,,H,23,,,,,,chemical shifts,Ka1,0.008,,M-1,62949,17180,1
69,6,1,,1,1,,,,,H,25,,,,,,chemical shifts,Ka1,0.006,,M-1,62949,17180,1
70,6,1,,1,1,,,,,H,15,,,,,,chemical shifts,Ka2,0.004,,M-1,62949,17180,1
71,6,1,,1,1,,,,,H,23,,,,,,chemical shifts,Ka2,0.005,,M-1,62949,17180,1
72,6,1,,1,1,,,,,H,25,,,,,,chemical shifts,Ka2,0.005,,M-1,62949,17180,1
1,,1,,1,1,,,,,,,,,,,,chemical shifts,K1,21000,6000,M-1,63014,17184,1
2,,2,,1,1,,,,,,,,,,,,chemical shifts,K2,4000,2000,M-1,63014,17184,1
1,1,1,,1,1,,,,,,,,,,,,chemical shifts,Kdmin,30,,uM,63032,17185,1
2,1,1,,1,1,,,,,,,,,,,,chemical shifts,Kdmax,60,,uM,63032,17185,1
3,2,1,,1,1,,,,,,,,,,,,chemical shifts,KI,21,,uM,63032,17185,1
4,2,1,,1,1,,,,,,,,,,,,chemical shifts,KI,293,,uM,63032,17185,1
5,3,1,,1,1,,,,,,,,,,,,chemical shifts,KI,21,,uM,63032,17185,1
6,3,1,,1,1,,,,,,,,,,,,chemical shifts,KI,293,,uM,63032,17185,1
1,,1,,1,1,5,5,ARG,,,,,,,,,chemical shifts,Kd,1.6,,uM,63047,17186,1
2,,1,,1,1,12,12,VAL,,,,,,,,,chemical shifts,Kd,1.6,,uM,63047,17186,1
3,,1,,1,1,17,17,LEU,,,,,,,,,chemical shifts,Kd,1.6,,uM,63047,17186,1
1,1,1,,1,1,2,2,TRP,,,,,,,,,chemical shifts,Kd,410,,uM,63064,17187,1
2,1,1,,1,1,9,9,ASN,,,,,,,,,chemical shifts,Kd,370,,uM,63064,17187,1
3,1,1,,1,1,123,123,GLN,,,,,,,,,chemical shifts,Kd,370,,uM,63064,17187,1
4,1,1,,1,1,,,,,,,,,,,,chemical shifts,Kd,40000000,,s-1M-1,63064,17187,1
5,1,1,,1,1,,,,,,,,,,,,chemical shifts,Kdmin,0.42,,mM,63064,17187,1
6,1,1,,1,1,,,,,,,,,,,,chemical shifts,Kdmax,0.46,,mM,63064,17187,1
7,1,1,,1,1,,,,,,,,,,,,chemical shifts,Kdeq,0.4,,mM,63064,17187,1
8,2,1,,1,1,,,,,,,,,,,,chemical shifts,Kd,1.2,,mM,63064,17187,1
1,1,1,,1,1,,,,,,,,,,,,chemical shifts,Kd,38000,14000,M-1,63645,17215,1
1,1,1,,1,1,,,,,,,,,,,,chemical shifts,Kd,30,,uM,63678,17217,1
1,,1,,1,1,82,,LYS,,,,,,,,,chemical shifts,Kd,1.18,,uM,63695,17218,1
2,,1,,1,1,55,,ARG,,,,,,,,,chemical shifts,Kd,1.19,,uM,63695,17218,1
3,,1,,1,1,98,,LEU,,,,,,,,,chemical shifts,Kdmin,0.95,,uM,63695,17218,1
4,,1,,1,1,102,,ASN,,,,,,,,,chemical shifts,Kdmin,0.95,,uM,63695,17218,1
5,,1,,1,1,103,,ALA,,,,,,,,,chemical shifts,Kdmin,0.95,,uM,63695,17218,1
6,,1,,1,1,98,,LEU,,,,,,,,,chemical shifts,Kdmax,1.20,,uM,63695,17218,1
7,,1,,1,1,102,,ASN,,,,,,,,,chemical shifts,Kdmax,1.20,,uM,63695,17218,1
8,,1,,1,1,103,,ALA,,,,,,,,,chemical shifts,Kdmax,1.20,,uM,63695,17218,1
1,1,1,,1,1,,,,,,,,,,,,chemical shifts,Kdmajor,6.16,0.25,mM,63710,17219,1
2,1,1,,1,1,,,,,,,,,,,,chemical shifts,Kdminor,5.91,0.32,mM,63710,17219,1
1,1,1,,1,1,,,,,,,,,,,,chemical shifts,Kd,0.00086,0.00003,M,63739,17220,1
2,1,2,,1,1,,,,,,,,,,,,chemical shifts,Kd,0.00015,0.0001,M,63739,17220,1
3,1,3,,1,1,,,,,,,,,,,,chemical shifts,Kd,0.00021,0.0004,M,63739,17220,1
1,,1,,1,1,,,,,,,,,,,,chemical shifts,Kdmax,0.00001,,M,63770,17222,1
2,,1,,1,1,,,,,,,,,,,,chemical shifts,Kdmin,0.000001,,M,63770,17222,1
3,,1,,1,1,,,,,,,,,,,,chemical shifts,Kamin,50000000,,M-1s-1,63770,17222,1
4,,2,,1,1,,,,,,,,,,,,chemical shifts,Kdmax,0.00001,,M,63770,17222,1
5,,2,,1,1,,,,,,,,,,,,chemical shifts,Kdmin,0.000001,,M,63770,17222,1
6,,2,,1,1,,,,,,,,,,,,chemical shifts,Kamin,50000000,,M-1s-1,63770,17222,1
7,,3,,1,1,,,,,,,,,,,,chemical shifts,Kdmax,0.00001,,M,63770,17222,1
8,,3,,1,1,,,,,,,,,,,,chemical shifts,Kdmin,0.000001,,M,63770,17222,1
9,,3,,1,1,,,,,,,,,,,,chemical shifts,Kamin,50000000,,M-1s-1,63770,17222,1
1,1,1,,1,1,,,,,,,,,,,,chemical shifts,kon,630,70,MM-1s-1,63787,17223,1
1,1,1,,1,1,,,,,,,,,,,,chemical shifts,Kd,18,5,uM,63809,17224,1
2,2,1,,1,1,,,,,,,,,,,,chemical shifts,Kd,18,5,uM,63809,17224,1
3,3,1,,1,1,,,,,,,,,,,,chemical shifts,Kd,18,5,uM,63809,17224,1
4,4,1,,1,1,,,,,,,,,,,,chemical shifts,Kd,18,5,uM,63809,17224,1
5,5,1,,1,1,,,,,,,,,,,,chemical shifts,Kd,18,5,uM,63809,17224,1
6,6,1,,1,1,,,,,,,,,,,,chemical shifts,Kd,18,5,uM,63809,17224,1
7,7,1,,1,1,,,,,,,,,,,,chemical shifts,Kd,18,5,uM,63809,17224,1
1,1,1,,1,1,,15,TRP,,,,,,,,,chemical shifts,Kd,0.00014,,M,63825,17225,1
2,1,2,,1,1,,37,HIS,,,,,,,,,chemical shifts,Kd,0.00016,,M,63825,17225,1
1,1,1,,1,1,,,,,,,,,,,,chemical shifts,Kd,3.4,0.3,mM,65960,17333,1
2,2,1,,1,1,,,,,,,,,,,,chemical shifts,Kd,3.4,0.3,mM,65960,17333,1
3,3,1,,1,1,,,,,,,,,,,,chemical shifts,Kd,3.4,0.3,mM,65960,17333,1
4,4,1,,1,1,,,,,,,,,,,,chemical shifts,Kd,3.4,0.3,mM,65960,17333,1
1,1,1,,1,1,,,,,,,,,,,,chemical shifts,Kd,1.61,24,mM,65975,17334,1
2,2,2,,1,1,,,,,,,,,,,,chemical shifts,Kd,27,4.4,uM,65975,17334,1
1,1,1,,1,1,,165,SER,,,,,,,,,chemical shifts,Kd,4.8,0.3,mM,65990,17338,1
2,1,1,,1,1,,164,CYS,,,,,,,,,chemical shifts,Kd,4.8,0.3,mM,65990,17338,1
3,1,1,,1,1,,170,ILE,,,,,,,,,chemical shifts,Kd,4.8,0.3,mM,65990,17338,1
1,1,1,,1,1,,,,,,,,,,,,chemical shifts,Kamin,50000,,M-1s-1,66015,17339,1
2,2,1,,1,1,,,,,,,,,,,,chemical shifts,Kamin,50000,,M-1s-1,66015,17339,1
3,3,1,,1,1,,,,,,,,,,,,chemical shifts,Kamin,50000,,M-1s-1,66015,17339,1
4,1,1,,1,1,,,,,,,,,,,,chemical shifts,Kamax,2000000,,M-1s-1,66015,17339,1
5,2,1,,1,1,,,,,,,,,,,,chemical shifts,Kamax,2000000,,M-1s-1,66015,17339,1
6,3,1,,1,1,,,,,,,,,,,,chemical shifts,Kamax,2000000,,M-1s-1,66015,17339,1
1,,1,,1,1,,,,,,,,,,,,chemical shifts,Kd,149,22,uM,66060,17341,1
1,1,1,,1,1,,51,LYS,,,,,,,,,chemical shifts,Kd,4.3,,mM,68371,17459,1
1,,1,,1,1,,,,,,,,,,,,chemical shifts,K1,21000,6000,M-1,68427,17462,1
2,,2,,1,1,,,,,,,,,,,,chemical shifts,K2,4000,2000,M-1,68427,17462,1
